BDBM361341 (R)-N1-(4-aminobutan-2- yl)-4-(6-aminopyridin-3- yl)-3-(1H-tetrazol-5- yl)benzene-1,2- disulfonamide::US10221163, Example 498::US10544130, Example 498
SMILES C[C@H](CCN)NS(=O)(=O)c1ccc(-c2ccc(N)nc2)c(-c2nn[nH]n2)c1S(N)(=O)=O
InChI Key
Data  6 IC50
  Tab Delimited (TSV)   2D SDfile   Computed 3D by Vconf -m prep SDfile
Find this compound or compounds like it in BindingDB:
Activity Spreadsheet -- Enzyme Inhibition Constant Data from BindingDB
Found 6 hits for monomerid = 361341
TargetMetallo-beta-lactamase type 2(Serratia marcescens)
Merck Sharp & Dohme
US Patent
LigandPNGBDBM361341((R)-N1-(4-aminobutan-2- yl)-4-(6-aminopyridin-3- y...)
Affinity DataIC50:  0.0760nM. Assay description: The Class B enzyme activities were measured in the presence of the test inhibitor in a fluorescence assay against a commercially available substrate ...
Ligand InfoPC cidPC sid
In DepthDetails US Patent
TargetMetallo-beta-lactamase type 2(Klebsiella pneumoniae)
Merck Sharp & Dohme
US Patent
LigandPNGBDBM361341((R)-N1-(4-aminobutan-2- yl)-4-(6-aminopyridin-3- y...)
Affinity DataIC50:  0.0150nM. Assay description: The Class B enzyme activities were measured in the presence of the test inhibitor in a fluorescence assay against a commercially available substrate ...
Ligand InfoPC cidPC sid
In DepthDetails US Patent
TargetBeta-lactamase()
Merck Sharp & Dohme
US Patent
LigandPNGBDBM361341((R)-N1-(4-aminobutan-2- yl)-4-(6-aminopyridin-3- y...)
Affinity DataIC50:  0.0510nM
Ligand InfoPC cidPC sid
In DepthDetails US Patent
TargetMetallo-beta-lactamase type 2(Serratia marcescens)
Merck Sharp & Dohme
US Patent
LigandPNGBDBM361341((R)-N1-(4-aminobutan-2- yl)-4-(6-aminopyridin-3- y...)
Affinity DataIC50:  0.0760nM. Assay description: The Class B enzyme activities were measured in the presence of the test inhibitor in a fluorescence assay against a commercially available substrate ...
Ligand InfoPC cidPC sid
In DepthDetails US Patent
TargetMetallo-beta-lactamase type 2(Klebsiella pneumoniae)
Merck Sharp & Dohme
US Patent
LigandPNGBDBM361341((R)-N1-(4-aminobutan-2- yl)-4-(6-aminopyridin-3- y...)
Affinity DataIC50:  0.0150nM
Ligand InfoPC cidPC sid
In DepthDetails US Patent
TargetVIM-1 metallo-beta-lactamase(Klebsiella pneumoniae)
Merck Sharp & Dohme
US Patent
LigandPNGBDBM361341((R)-N1-(4-aminobutan-2- yl)-4-(6-aminopyridin-3- y...)
Affinity DataIC50:  0.0510nM. Assay description: The Class B enzyme activities were measured in the presence of the test inhibitor in a fluorescence assay against a commercially available substrate ...
Ligand InfoPC cidPC sid
In DepthDetails US Patent