BDBM361610 US10221175, Compound 15
SMILES Cc1nnc2ccc3CN(Cc4c(F)cc(cc4F)-c4ccc5nn(C)cc5c4)C(=O)c3n12
InChI Key InChIKey=GBQBSNDJOJRZFR-UHFFFAOYSA-N
Data  1 EC50
  Tab Delimited (TSV)   2D SDfile   Computed 3D by Vconf -m prep SDfile
Find this compound or compounds like it in BindingDB:
Activity Spreadsheet -- Enzyme Inhibition Constant Data from BindingDB
Found 1 hit for monomerid = 361610
TargetMuscarinic acetylcholine receptor M1(Homo sapiens (Human))
Vanderbilt University
US Patent
LigandPNGBDBM361610(US10221175, Compound 15)
Affinity DataEC50:  1.24E+3nM. Assay description: For high throughput measurement of agonist-evoked increases in intracellular calcium, CHO-K1 cells stably expressing muscarinic receptors were plated...
Ligand InfoPC cidPC sid
In DepthDetails US Patent