BDBM361762 US10221177, Compound 125
SMILES CCOc1ncc(cc1C(F)(F)F)-c1cccc(NC(=O)[C@H](C)n2cnc3n(C)c(=O)n(CC(=O)CC)c(=O)c23)n1
InChI Key InChIKey=IYXIXNIKYCFBDN-AWEZNQCLSA-N
Data  1 IC50
  Tab Delimited (TSV)   2D SDfile   Computed 3D by Vconf -m prep SDfile
Find this compound or compounds like it in BindingDB:
Activity Spreadsheet -- Enzyme Inhibition Constant Data from BindingDB
Found 1 hit for monomerid = 361762
TargetTransient receptor potential cation channel subfamily A member 1(Homo sapiens (Human))
Hydra Biosciences
US Patent
LigandPNGBDBM361762(US10221177, Compound 125)
Affinity DataIC50:  1nM. Assay description: Compounds of Formula (I) inhibit the TRPA1 channel, as shown by measuring the in vitro inhibition of human TRPA1, provided in data tables shown in Ta...
Ligand InfoPC cidPC sid
In DepthDetails US Patent