BDBM36190 (+/-)-cis-2-methylcyclohexanol
SMILES C[C@H]1CCCC[C@H]1O
InChI Key InChIKey=NDVWOBYBJYUSMF-NKWVEPMBSA-N
Data  4 KI  1 ITC
  Tab Delimited (TSV)   2D SDfile   Computed 3D by Vconf -m prep SDfile
Find this compound or compounds like it in BindingDB:
Activity Spreadsheet -- Enzyme Inhibition Constant Data from BindingDB
Found 4 hits for monomerid = 36190
TargetCarbonic anhydrase 2(Homo sapiens (Human))
Artvin£Oruh University
Curated by ChEMBL
LigandPNGBDBM36190((+/-)-cis-2-methylcyclohexanol)
Affinity DataKi:  340nM. Assay description: Inhibition of human carbonic anhydrase 2 esterase activity using 4-nitrophenylacetate as substrate
In DepthDetails ArticlePubMed
TargetCarbonic anhydrase 1(Homo sapiens (Human))
Artvin£Oruh University
Curated by ChEMBL
LigandPNGBDBM36190((+/-)-cis-2-methylcyclohexanol)
Affinity DataKi:  7.56E+3nM. Assay description: Inhibition of human carbonic anhydrase 1 esterase activity using 4-nitrophenylacetate as substrate
In DepthDetails ArticlePubMed
TargetCarbonic anhydrase 4(Homo sapiens (Human))
Artvin£Oruh University
Curated by ChEMBL
LigandPNGBDBM36190((+/-)-cis-2-methylcyclohexanol)
Affinity DataKi:  8.43E+3nM. Assay description: Inhibition of human carbonic anhydrase 4 esterase activity using 4-nitrophenylacetate as substrate
In DepthDetails ArticlePubMed
TargetCarbonic anhydrase 6(Homo sapiens (Human))
Artvin£Oruh University
Curated by ChEMBL
LigandPNGBDBM36190((+/-)-cis-2-methylcyclohexanol)
Affinity DataKi:  4.02E+5nM. Assay description: Inhibition of human carbonic anhydrase 6 esterase activity using 4-nitrophenylacetate as substrate
In DepthDetails ArticlePubMed
Activity Spreadsheet -- ITC Data from BindingDB
Found 1 hit for monomerid = 36190
HostPNGBDBM11(beta-cyclodextrin | betadex)
Nist
GuestPNGBDBM36190((+/-)-cis-2-methylcyclohexanol)
ITC DataΔG°: -4.08kcal/mole −TΔS°: -1.71kcal/mole ΔH°: -2.37kcal/mole logk: 981
pH: 6.9 T: 25.00°C
In DepthDetails Article