BDBM361900 (R and S)-8-(1-ethyl-5-methyl- 1H-pyrazol-4-yl)-9-methyl-6-[1- (piperidin-1- ylcarbonyl)propoxy]-9H-purine::US10221178, Compound 1-2
SMILES CCC(Oc1ncnc2n(C)c(nc12)-c1cnn(CC)c1C)C(=O)N1CCCCC1
InChI Key InChIKey=VXHZVENFQBECDW-UHFFFAOYSA-N
Data  1 IC50
  Tab Delimited (TSV)   2D SDfile   Computed 3D by Vconf -m prep SDfile
Find this compound or compounds like it in BindingDB:
Activity Spreadsheet -- Enzyme Inhibition Constant Data from BindingDB
Found 1 hit for monomerid = 361900
TargetPhosphatidylinositol 4,5-bisphosphate 3-kinase catalytic subunit delta isoform(Homo sapiens (Human))
Merck Sharp & Dohme
US Patent
LigandPNGBDBM361900((R and S)-8-(1-ethyl-5-methyl- 1H-pyrazol-4-yl)-9-...)
Affinity DataIC50:  240nM. Assay description: Compounds are serially diluted (3-fold in 100% DMSO) across a 384-well polypropylene source plated from column 3 to column 12 and column 13 to column...
Ligand InfoPC cidPC sid
In DepthDetails US Patent