BDBM361929 9-ethyl-N-{(1S)-1-[((R and S)-3- methylpiperidin-1- yl)carbonyl]propyl}-8-(2- methylpyrimidin-5-yl)-9H-purin- 6-amine::US10221178, Compound 2-23
SMILES CC[C@H](Nc1ncnc2n(CC)c(nc12)-c1cnc(C)nc1)C(=O)N1CCCC(C)C1
InChI Key InChIKey=POBROPCOWPNJKQ-JRZJBTRGSA-N
Data  1 IC50
  Tab Delimited (TSV)   2D SDfile   Computed 3D by Vconf -m prep SDfile
Find this compound or compounds like it in BindingDB:
Activity Spreadsheet -- Enzyme Inhibition Constant Data from BindingDB
Found 1 hit for monomerid = 361929
TargetPhosphatidylinositol 4,5-bisphosphate 3-kinase catalytic subunit delta isoform(Homo sapiens (Human))
Merck Sharp & Dohme
US Patent
LigandPNGBDBM361929(9-ethyl-N-{(1S)-1-[((R and S)-3- methylpiperidin-1...)
Affinity DataIC50:  9.30nM. Assay description: Compounds are serially diluted (3-fold in 100% DMSO) across a 384-well polypropylene source plated from column 3 to column 12 and column 13 to column...
Ligand InfoPC cidPC sid
In DepthDetails US Patent