BDBM362019 5-Chloro-N-(5-oxo-2,3,4,5-tetrahydropyrido[3,2-f][1,4]oxazepin-7-yl)-2-(trifluoromethoxy)benzenesulfonamide::US10221195, Example 13
SMILES FC(F)(F)Oc1ccc(Cl)cc1S(=O)(=O)Nc1cnc2OCCNC(=O)c2c1
InChI Key InChIKey=JZYOCSBJVSWMPK-UHFFFAOYSA-N
Data  1 IC50
  Tab Delimited (TSV)   2D SDfile   Computed 3D by Vconf -m prep SDfile
Find this compound or compounds like it in BindingDB:
Activity Spreadsheet -- Enzyme Inhibition Constant Data from BindingDB
Found 1 hit for monomerid = 362019
TargetAlkaline phosphatase, tissue-nonspecific isozyme(Homo sapiens (Human))
Daiichi Sankyo
US Patent
LigandPNGBDBM362019(5-Chloro-N-(5-oxo-2,3,4,5-tetrahydropyrido[3,2-f][...)
Affinity DataIC50:  3.40nM. Assay description: COS1 cells (DS Pharma Biomedical Co., Ltd.) were transfected with human TNAP (OriGene Technologies, Inc.) using Lipofectamine LTX & Plus reagent (Inv...
Ligand InfoPC cidPC sid
In DepthDetails US Patent