BDBM362030 (S)-3-(5-chloro-2-(1-((2,6-diamino-5-chloropyrimidin-4-yl)amino)butyl)-4-oxoquinazolin-3(4H)-yl)benzamide::US10221197, Compound 23
SMILES C[C@H](Nc1nc(N)nc(C(F)F)c1C#N)c1nc2c(F)ccc(Cl)c2c(=O)n1-c1cccc(c1)C(N)=O
InChI Key InChIKey=YQJOKVZPJVNABR-VIFPVBQESA-N
Data  3 IC50
  Tab Delimited (TSV)   2D SDfile   Computed 3D by Vconf -m prep SDfile
Find this compound or compounds like it in BindingDB:
Activity Spreadsheet -- Enzyme Inhibition Constant Data from BindingDB
Found 3 hits for monomerid = 362030
TargetPhosphatidylinositol 3-kinase regulatory subunit beta(Homo sapiens (Human))
Gilead Sciences
US Patent
LigandPNGBDBM362030((S)-3-(5-chloro-2-(1-((2,6-diamino-5-chloropyrimid...)
Affinity DataIC50:  1.20E+4nM. Assay description: TR-FRET monitored the formation of 3,4,5-inositol triphosphate molecule that competed with fluorescently labeled PIP3 for binding to the GRP-1 plecks...
Ligand InfoPC cidPC sid
In DepthDetails US Patent
TargetPhosphatidylinositol 4,5-bisphosphate 3-kinase catalytic subunit gamma isoform(Homo sapiens (Human))
Gilead Sciences
US Patent
LigandPNGBDBM362030((S)-3-(5-chloro-2-(1-((2,6-diamino-5-chloropyrimid...)
Affinity DataIC50:  3.90E+6nM
Ligand InfoPC cidPC sid
In DepthDetails US Patent
TargetPhosphatidylinositol 4,5-bisphosphate 3-kinase catalytic subunit delta isoform(Homo sapiens (Human))
Gilead Sciences
US Patent
LigandPNGBDBM362030((S)-3-(5-chloro-2-(1-((2,6-diamino-5-chloropyrimid...)
Affinity DataIC50:  2.00E+3nM
Ligand InfoPC cidPC sid
In DepthDetails US Patent