BDBM362415 US9834554, Example 30
SMILES C[C@H]1CC[C@H](CN1C(=O)C1(C)COC1)c1nn(-c2ccc(cc2)C(=O)Nc2cc(ccn2)C2CC2)c2c(N)nccc12
InChI Key InChIKey=FFRDFWIAPSYGIM-WMZHIEFXSA-N
Data  1 IC50
  Tab Delimited (TSV)   2D SDfile   Computed 3D by Vconf -m prep SDfile
Find this compound or compounds like it in BindingDB:
Activity Spreadsheet -- Enzyme Inhibition Constant Data from BindingDB
Found 1 hit for monomerid = 362415
TargetTyrosine-protein kinase BTK(Homo sapiens (Human))
Merck Sharp & Dohme
US Patent
LigandPNGBDBM362415(US9834554, Example 30)
Affinity DataIC50:  0.980nM. Assay description: BTK enzymatic activity was determined with the LANCE (Lanthanide Chelate Excite) TR-FRET (Time-resolved fluorescence resonance energy transfer) assay...
Ligand InfoPC cidPC sid
In DepthDetails US Patent