BDBM362460 Roche-Dataset for PDE10A, Compound 215::US10562916, Compound 20::US9834564, Compound 20
SMILES Cn1cc(nc1CCc1cnc2ccccc2n1)-c1ccccc1
InChI Key InChIKey=POYATVYDWRIRCE-UHFFFAOYSA-N
Data  3 IC50
  Tab Delimited (TSV)   2D SDfile   Computed 3D by Vconf -m prep SDfile
Find this compound or compounds like it in BindingDB:
Activity Spreadsheet -- Enzyme Inhibition Constant Data from BindingDB
Found 3 hits for monomerid = 362460
TargetcAMP and cAMP-inhibited cGMP 3',5'-cyclic phosphodiesterase 10A(Homo sapiens (Human))
Sunovion Pharmaceuticals
US Patent
LigandPNGBDBM362460(Roche-Dataset for PDE10A, Compound 215 | US1056291...)
Affinity DataIC50: <500nM. Assay description: The activities of the compounds were determined using the Molecular Devices IMAP PDE Fluorescence Polarization assay using recombinant human PDE-10 e...
Ligand InfoPC cidPC sid
In DepthDetails US Patent
TargetcAMP and cAMP-inhibited cGMP 3',5'-cyclic phosphodiesterase 10A(Homo sapiens (Human))
Sunovion Pharmaceuticals
US Patent
LigandPNGBDBM362460(Roche-Dataset for PDE10A, Compound 215 | US1056291...)
Affinity DataIC50:  21nM. Assay description: Human PDE10A IC50 values were determined by using purified enzyme (Biomol cat. # SE-534) in a scintillation proximity assay (SPA) in 96 well plates (...
Ligand InfoPC cidPC sid
In DepthDetails ArticlePubMed
TargetcAMP and cAMP-inhibited cGMP 3',5'-cyclic phosphodiesterase 10A(Homo sapiens (Human))
Sunovion Pharmaceuticals
US Patent
LigandPNGBDBM362460(Roche-Dataset for PDE10A, Compound 215 | US1056291...)
Affinity DataIC50: <500nM. Assay description: In one embodiment, the compounds provided herein were assayed for their ability to inhibit human PDE-10A. In one embodiment, the activities of the co...
Ligand InfoPC cidPC sid
In DepthDetails US Patent