BDBM362626 US10562916, Compound 188::US9834564, Compound 188
SMILES C(Cc1cnc2ccccc2n1)c1nc2c3cccnc3ccn2n1
InChI Key InChIKey=PDWMQUAKIDIUOS-UHFFFAOYSA-N
Data  2 IC50
  Tab Delimited (TSV)   2D SDfile   Computed 3D by Vconf -m prep SDfile
Find this compound or compounds like it in BindingDB:
Activity Spreadsheet -- Enzyme Inhibition Constant Data from BindingDB
Found 2 hits for monomerid = 362626
TargetcAMP and cAMP-inhibited cGMP 3',5'-cyclic phosphodiesterase 10A(Homo sapiens (Human))
Sunovion Pharmaceuticals
US Patent
LigandPNGBDBM362626(US10562916, Compound 188 | US9834564, Compound 188)
Affinity DataIC50: <500nM. Assay description: In one embodiment, the compounds provided herein were assayed for their ability to inhibit human PDE-10A. In one embodiment, the activities of the co...
Ligand InfoPC cidPC sid
In DepthDetails US Patent
TargetcAMP and cAMP-inhibited cGMP 3',5'-cyclic phosphodiesterase 10A(Homo sapiens (Human))
Sunovion Pharmaceuticals
US Patent
LigandPNGBDBM362626(US10562916, Compound 188 | US9834564, Compound 188)
Affinity DataIC50: <500nM. Assay description: The activities of the compounds were determined using the Molecular Devices IMAP PDE Fluorescence Polarization assay using recombinant human PDE-10 e...
Ligand InfoPC cidPC sid
In DepthDetails US Patent