BDBM362880 US9844535, ID 11a-23 L97L03
SMILES Cn1c(c(I)c2cc(C(O)=O)c(O)cc12)-c1cccc(NC(=O)C(=O)Nc2ccccc2-c2ccc(CCO)o2)c1
InChI Key InChIKey=UBWHIIBUSSCPSL-UHFFFAOYSA-N
Data  1 IC50
  Tab Delimited (TSV)   2D SDfile   Computed 3D by Vconf -m prep SDfile
Find this compound or compounds like it in BindingDB:
Activity Spreadsheet -- Enzyme Inhibition Constant Data from BindingDB
Found 1 hit for monomerid = 362880
TargetPhosphatidylinositol 3,4,5-trisphosphate 5-phosphatase 2(Homo sapiens (Human))
Indiana University Research And Technology
US Patent
LigandPNGBDBM362880(US9844535, ID 11a-23 L97L03)
Affinity DataIC50:  370nM. Assay description: PTP assays were conducted as previously described in Kontaridis et al., J Biol Chem. 2006; 281:6785-6792, using para-nitrophenyl phosphate (pNPP, obt...
Ligand InfoPC cidPC sid
In DepthDetails US Patent