BDBM362949 3-((6-Chloro-7-fluoro-2-methyl-1-(3-oxo-3-(phenylamino)propyl)-1H-indol-3-yl)thio)benzoic acid ::US9850203, Compound 1-16
SMILES Cc1c(Sc2cccc(c2)C(O)=O)c2ccc(Cl)c(F)c2n1CCC(=O)Nc1ccccc1
InChI Key InChIKey=WOYTUUCRGISZJX-UHFFFAOYSA-N
Data  1 IC50
  Tab Delimited (TSV)   2D SDfile   Computed 3D by Vconf -m prep SDfile
Find this compound or compounds like it in BindingDB:
Activity Spreadsheet -- Enzyme Inhibition Constant Data from BindingDB
Found 1 hit for monomerid = 362949
TargetEctonucleotide pyrophosphatase/phosphodiesterase family member 2(Homo sapiens (Human))
Pharmakea
US Patent
LigandPNGBDBM362949(3-((6-Chloro-7-fluoro-2-methyl-1-(3-oxo-3-(phenyla...)
Affinity DataIC50: <500nM. Assay description: ATX activity is assayed in concentrated conditioned media from Hep3B human hepatocellular carcinoma cells by measuring the amount of choline released...
Ligand InfoPC cidPC sid
In DepthDetails US Patent