BDBM363027 6-((6-Chloro-7-fluoro-1-(2-(3-hydroxy-3-(trifluoromethyl)pyrrolidin-1-yl)-2-oxoethyl)-2-methyl-1H-indol-3-yl)thio)picolinic acid ::US9850203, Compound 2-56
SMILES Cc1c(Sc2cccc(n2)C(O)=O)c2ccc(Cl)c(F)c2n1CC(=O)N1CCC(O)(C1)C(F)(F)F
InChI Key InChIKey=AJVSJHXIHIBLEH-UHFFFAOYSA-N
Data  1 IC50
  Tab Delimited (TSV)   2D SDfile   Computed 3D by Vconf -m prep SDfile
Find this compound or compounds like it in BindingDB:
Activity Spreadsheet -- Enzyme Inhibition Constant Data from BindingDB
Found 1 hit for monomerid = 363027
TargetEctonucleotide pyrophosphatase/phosphodiesterase family member 2(Homo sapiens (Human))
Pharmakea
US Patent
LigandPNGBDBM363027(6-((6-Chloro-7-fluoro-1-(2-(3-hydroxy-3-(trifluoro...)
Affinity DataIC50: <500nM. Assay description: ATX activity is assayed in concentrated conditioned media from Hep3B human hepatocellular carcinoma cells by measuring the amount of choline released...
Ligand InfoPC cidPC sid
In DepthDetails US Patent