BDBM363040 3-((6-Chloro-1-(2-((3S,4S)-3-(dimethylamino)-4-hydroxypyrrolidin-1-yl)-2-oxoethyl)-7-fluoro-2-methyl-1H-indol-3-yl)thio)-2-fluorobenzoic acid ::US9850203, Compound 2-69
SMILES CN(C)[C@H]1CN(C[C@@H]1O)C(=O)Cn1c(C)c(Sc2cccc(C(O)=O)c2F)c2ccc(Cl)c(F)c12
InChI Key InChIKey=AXKJCQDWKMOJCD-IRXDYDNUSA-N
Data  1 IC50
  Tab Delimited (TSV)   2D SDfile   Computed 3D by Vconf -m prep SDfile
Find this compound or compounds like it in BindingDB:
Activity Spreadsheet -- Enzyme Inhibition Constant Data from BindingDB
Found 1 hit for monomerid = 363040
TargetEctonucleotide pyrophosphatase/phosphodiesterase family member 2(Homo sapiens (Human))
Pharmakea
US Patent
LigandPNGBDBM363040(3-((6-Chloro-1-(2-((3S,4S)-3-(dimethylamino)-4-hyd...)
Affinity DataIC50: <500nM. Assay description: ATX activity is assayed in concentrated conditioned media from Hep3B human hepatocellular carcinoma cells by measuring the amount of choline released...
Ligand InfoPC cidPC sid
In DepthDetails US Patent