BDBM363054 3-((2,6-dichloro-7-fluoro-1-(2-oxo-2-(spiro[cyclobutane-1,3′-indolin]-1′-yl)ethyl)-1H-indol-3-yl)thio)-2-fluorobenzoate::US9850203, Compound 4-121
SMILES [O-]C(=O)c1cccc(Sc2c(Cl)n(CC(=O)N3CC4(CCC4)c4ccccc34)c3c(F)c(Cl)ccc23)c1F
InChI Key InChIKey=XCQVEYRAODOGPF-UHFFFAOYSA-M
Data  1 IC50
  Tab Delimited (TSV)   2D SDfile   Computed 3D by Vconf -m prep SDfile
Find this compound or compounds like it in BindingDB:
Activity Spreadsheet -- Enzyme Inhibition Constant Data from BindingDB
Found 1 hit for monomerid = 363054
TargetEctonucleotide pyrophosphatase/phosphodiesterase family member 2(Homo sapiens (Human))
Pharmakea
US Patent
LigandPNGBDBM363054(3-((2,6-dichloro-7-fluoro-1-(2-oxo-2-(spiro[cyclob...)
Affinity DataIC50: <500nM. Assay description: ATX activity is assayed in concentrated conditioned media from Hep3B human hepatocellular carcinoma cells by measuring the amount of choline released...
Ligand InfoPC cidPC sid
In DepthDetails US Patent