BDBM363214 2-((2-((3-cyanobenzyl)oxy)-6-methoxy-4-((2-methyl-[1,1′-biphenyl]-3-yl)methoxy)benzyl)amino)-3-hydroxy-2-methylpropanoic acid::US9850225, Example 1137
SMILES COc1cc(OCc2cccc(c2C)-c2ccccc2)cc(OCc2cccc(c2)C#N)c1CNC(C)(CO)C(O)=O
InChI Key InChIKey=KRFPWDMSJMARBJ-UHFFFAOYSA-N
Data  1 IC50
  Tab Delimited (TSV)   2D SDfile   Computed 3D by Vconf -m prep SDfile
Find this compound or compounds like it in BindingDB:
Activity Spreadsheet -- Enzyme Inhibition Constant Data from BindingDB
Found 1 hit for monomerid = 363214
TargetProgrammed cell death 1 ligand 1(Homo sapiens (Human))
Bristol-Myers Squibb
US Patent
LigandPNGBDBM363214(2-((2-((3-cyanobenzyl)oxy)-6-methoxy-4-((2-methyl-...)
Affinity DataIC50:  5.30nM. Assay description: The interaction of PD-1 and PD-L1 can be assessed using soluble, purified preparations of the extracellular domains of the two proteins. The PD-1 and...
Ligand InfoPC cidPC sid
In DepthDetails US Patent