BDBM363230 (R)-2-(4-(2-chloro-3-(2,3-dihydrobenzo[b][1,4]dioxin-6-yl)benzyloxy)-2-((5-cyanopyridin-3-yl)methoxy)-5-methylbenzylamino)-3-hydroxypropanoic acid::US9850225, Example 1153
SMILES Cc1cc(CN[C@H](CO)C(O)=O)c(OCc2cncc(c2)C#N)cc1OCc1cccc(c1Cl)-c1ccc2OCCOc2c1
InChI Key InChIKey=XUHRDJHZYFULNG-HHHXNRCGSA-N
Data  1 IC50
  Tab Delimited (TSV)   2D SDfile   Computed 3D by Vconf -m prep SDfile
Find this compound or compounds like it in BindingDB:
Activity Spreadsheet -- Enzyme Inhibition Constant Data from BindingDB
Found 1 hit for monomerid = 363230
TargetProgrammed cell death 1 ligand 1(Homo sapiens (Human))
Bristol-Myers Squibb
US Patent
LigandPNGBDBM363230((R)-2-(4-(2-chloro-3-(2,3-dihydrobenzo[b][1,4]diox...)
Affinity DataIC50:  5.30nM. Assay description: The interaction of PD-1 and PD-L1 can be assessed using soluble, purified preparations of the extracellular domains of the two proteins. The PD-1 and...
Ligand InfoPC cidPC sid
In DepthDetails US Patent