BDBM363232 (R)-1-(4-(2-chloro-3-(2,3-dihydrobenzo[b][1,4]dioxin-6-yl)benzyloxy)-2-((5-cyanopyridin-3-yl)methoxy)-5-methylbenzyl)piperidine-2-carboxylic acid::US9850225, Example 1155
SMILES Cc1cc(CN2CCCC[C@@H]2C(O)=O)c(OCc2cncc(c2)C#N)cc1OCc1cccc(c1Cl)-c1ccc2OCCOc2c1
InChI Key InChIKey=ISKGSKOUFJODPP-SSEXGKCCSA-N
Data  1 IC50
  Tab Delimited (TSV)   2D SDfile   Computed 3D by Vconf -m prep SDfile
Find this compound or compounds like it in BindingDB:
Activity Spreadsheet -- Enzyme Inhibition Constant Data from BindingDB
Found 1 hit for monomerid = 363232
TargetProgrammed cell death 1 ligand 1(Homo sapiens (Human))
Bristol-Myers Squibb
US Patent
LigandPNGBDBM363232((R)-1-(4-(2-chloro-3-(2,3-dihydrobenzo[b][1,4]diox...)
Affinity DataIC50:  5.30nM. Assay description: The interaction of PD-1 and PD-L1 can be assessed using soluble, purified preparations of the extracellular domains of the two proteins. The PD-1 and...
Ligand InfoPC cidPC sid
In DepthDetails US Patent