BDBM363334 (S)-1-(5-chloro-2-((5-cyanopyridin-3-yl)methoxy)-4-((3-(2,3-dihydrobenzo[b][1,4]dioxin-6-yl)-2-methylbenzyl)oxy)benzyl)piperidine-2-carboxylic acid, TFA salt::US9850225, Example 1253
SMILES Cc1c(COc2cc(OCc3cncc(c3)C#N)c(CN3CCCC[C@H]3C(O)=O)cc2Cl)cccc1-c1ccc2OCCOc2c1
InChI Key InChIKey=JZRQGULNPQIOSX-HKBQPEDESA-N
Data  1 IC50
  Tab Delimited (TSV)   2D SDfile   Computed 3D by Vconf -m prep SDfile
Find this compound or compounds like it in BindingDB:
Activity Spreadsheet -- Enzyme Inhibition Constant Data from BindingDB
Found 1 hit for monomerid = 363334
TargetProgrammed cell death 1 ligand 1(Homo sapiens (Human))
Bristol-Myers Squibb
US Patent
LigandPNGBDBM363334((S)-1-(5-chloro-2-((5-cyanopyridin-3-yl)methoxy)-4...)
Affinity DataIC50:  5.30nM. Assay description: The interaction of PD-1 and PD-L1 can be assessed using soluble, purified preparations of the extracellular domains of the two proteins. The PD-1 and...
Ligand InfoPC cidPC sid
In DepthDetails US Patent