BDBM36338 CID24762168::{4-[2-trans-(4-Amino-cyclohexylamino)-9-benzo[1,3]dioxol-5-yl-9H-purin-6-ylamino]-phenyl}-piperidin-1-yl-methanone, 6
SMILES N[C@H]1CC[C@@H](CC1)Nc1nc(Nc2ccc(cc2)C(=O)N2CCCCC2)c2ncn(-c3ccc4OCOc4c3)c2n1
InChI Key InChIKey=ITNKBCGJSHHANR-AQYVVDRMSA-N
Data  1 IC50  1 EC50
  Tab Delimited (TSV)   2D SDfile   Computed 3D by Vconf -m prep SDfile
Find this compound or compounds like it in BindingDB:
Activity Spreadsheet -- Enzyme Inhibition Constant Data from BindingDB
Found 2 hits for monomerid = 36338
TargetCalcium-dependent protein kinase 1(Plasmodium Falciparum)
The Scripps Research Institute
LigandPNGBDBM36338(CID24762168 | {4-[2-trans-(4-Amino-cyclohexylamino...)
Affinity DataEC50:  400nMpH: 7.5 T: 2°C. Assay description: This parasite proliferation assay, a modification of published DNA intercalating fluorescent dye-based assay, was adapted to 384-well plate format an...
In DepthDetails ArticlePubMed
TargetCalcium-dependent protein kinase 1(Plasmodium Falciparum)
The Scripps Research Institute
LigandPNGBDBM36338(CID24762168 | {4-[2-trans-(4-Amino-cyclohexylamino...)
Affinity DataIC50:  342nMpH: 7.5 T: 2°C. Assay description: The test compounds and enzyme were mixed in buffer, and the substrate and [gamma-33P] ATP/ATP were added to the mixture to initiate the reaction. Aft...
In DepthDetails ArticlePubMed