BDBM363492 (R)-9-(2-hydroxy-2-(4-methyl-1-oxo-1,3-dihydroisobenzofuran-5-yl)ethyl)-1-methyl-4-(4-methyl-5-oxo-2,5-dihydrofuran-3-yl)-1,4,9-triazaspiro[5.5]undecan-5-one::US9850245, Example 50
SMILES CC1=C(COC1=O)N1CCOC2(CCN(CCc3ccc4C(=O)OCc4c3C)CC2)C1=O
InChI Key InChIKey=KCNGPWDBXGGEAX-UHFFFAOYSA-N
Data  1 IC50
  Tab Delimited (TSV)   2D SDfile   Computed 3D by Vconf -m prep SDfile
Find this compound or compounds like it in BindingDB:
Activity Spreadsheet -- Enzyme Inhibition Constant Data from BindingDB
Found 1 hit for monomerid = 363492
TargetATP-sensitive inward rectifier potassium channel 1(Homo sapiens (Human))
Merck Sharp & Dohme
US Patent
LigandPNGBDBM363492((R)-9-(2-hydroxy-2-(4-methyl-1-oxo-1,3-dihydroisob...)
Affinity DataIC50:  16nM. Assay description: Blocking of Kir1.1 (ROMK1) currents was examined by whole cell voltage clamp (Hamill et. al. Pfluegers Archives 391:85-100 (1981)) using the IonWorks...
Ligand InfoPC cidPC sid
In DepthDetails US Patent