BDBM363495 9-(3,5-Dimethylisoxazol-4-yl)-5-methyl-3-phenyl-2,3-dihydro[1,4]oxazino[2,3,4-hi]indazol-6(5H)-one::US9850257, Example 2
SMILES Cc1noc(C)c1-c1ccc2c3c1OCC(c1ccccc1)n3n(C)c2=O
InChI Key InChIKey=WMQJYIWRCZWGDF-UHFFFAOYSA-N
Data  2 IC50
  Tab Delimited (TSV)   2D SDfile   Computed 3D by Vconf -m prep SDfile
Find this compound or compounds like it in BindingDB:
Activity Spreadsheet -- Enzyme Inhibition Constant Data from BindingDB
Found 2 hits for monomerid = 363495
TargetBromodomain-containing protein 4 [342-460](Homo sapiens (Human))
Incyte
US Patent
LigandPNGBDBM363495(9-(3,5-Dimethylisoxazol-4-yl)-5-methyl-3-phenyl-2,...)
Affinity DataIC50: <200nM. Assay description: BRD4-BD1 and BRD4-BD2 assays were conducted in white 384-well polystyrene plate in a final volume of 20 μL for BD1 and 40 μL for BD2. Inhib...
Ligand InfoPC cidPC sid
In DepthDetails US Patent
TargetBromodomain-containing protein 4 [49-170](Homo sapiens (Human))
Incyte
US Patent
LigandPNGBDBM363495(9-(3,5-Dimethylisoxazol-4-yl)-5-methyl-3-phenyl-2,...)
Affinity DataIC50: <200nM. Assay description: BRD4-BD1 and BRD4-BD2 assays were conducted in white 384-well polystyrene plate in a final volume of 20 μL for BD1 and 40 μL for BD2. Inhib...
Ligand InfoPC cidPC sid
In DepthDetails US Patent