BDBM363496 9-(3,5-Dimethylisoxazol-4-yl)-6-methoxy-3-phenyl-2,3-dihydro[1,4]oxazino[2,3,4-hi]indazole::US9850257, Example 3
SMILES COc1nn2C(COc3c(ccc1c23)-c1c(C)noc1C)c1ccccc1
InChI Key InChIKey=IFBJXLKXSMLVQP-UHFFFAOYSA-N
Data  2 IC50
  Tab Delimited (TSV)   2D SDfile   Computed 3D by Vconf -m prep SDfile
Find this compound or compounds like it in BindingDB:
Activity Spreadsheet -- Enzyme Inhibition Constant Data from BindingDB
Found 2 hits for monomerid = 363496
TargetBromodomain-containing protein 4 [342-460](Homo sapiens (Human))
Incyte
US Patent
LigandPNGBDBM363496(9-(3,5-Dimethylisoxazol-4-yl)-6-methoxy-3-phenyl-2...)
Affinity DataIC50: <200nM. Assay description: BRD4-BD1 and BRD4-BD2 assays were conducted in white 384-well polystyrene plate in a final volume of 20 μL for BD1 and 40 μL for BD2. Inhib...
Ligand InfoPC cidPC sid
In DepthDetails US Patent
TargetBromodomain-containing protein 4 [49-170](Homo sapiens (Human))
Incyte
US Patent
LigandPNGBDBM363496(9-(3,5-Dimethylisoxazol-4-yl)-6-methoxy-3-phenyl-2...)
Affinity DataIC50: <200nM. Assay description: BRD4-BD1 and BRD4-BD2 assays were conducted in white 384-well polystyrene plate in a final volume of 20 μL for BD1 and 40 μL for BD2. Inhib...
Ligand InfoPC cidPC sid
In DepthDetails US Patent