BDBM363793 2-Ethyl-6,7-dimethoxy-N-(4-methoxybenzyl)-1-oxo-1,2-dihydroisoquinoline-4-carboxamide::US9856220, Example 152
SMILES CCn1cc(C(=O)NCc2ccc(OC)cc2)c2cc(OC)c(OC)cc2c1=O
InChI Key InChIKey=BHZVUNBJYDURSG-UHFFFAOYSA-N
Data  1 IC50
  Tab Delimited (TSV)   2D SDfile   Computed 3D by Vconf -m prep SDfile
Find this compound or compounds like it in BindingDB:
Activity Spreadsheet -- Enzyme Inhibition Constant Data from BindingDB
Found 1 hit for monomerid = 363793
TargetcAMP and cAMP-inhibited cGMP 3',5'-cyclic phosphodiesterase 10A(Homo sapiens (Human))
Abbvie Deutschland
US Patent
LigandPNGBDBM363793(2-Ethyl-6,7-dimethoxy-N-(4-methoxybenzyl)-1-oxo-1,...)
Affinity DataIC50:  350nM. Assay description: The PDE enzymatic reaction was carried out in assay buffer (20 mM Tris-HCl pH7.5, 10 mM MgCl2, 0.1% bovine serum albumin) containing enzyme and subst...
In DepthDetails US Patent