BDBM36390 (Z)-D-Gluconhydroximo-1,5-lactam, 15::CID445248
SMILES OC[C@H]1N=C(NO)[C@H](O)[C@@H](O)[C@@H]1O
InChI Key InChIKey=VBXHGXTYZGYTQG-SQOUGZDYSA-N
Data  1 KI
  Tab Delimited (TSV)   2D SDfile   Computed 3D by Vconf -m prep SDfile
Find this compound or compounds like it in BindingDB:
Activity Spreadsheet -- Enzyme Inhibition Constant Data from BindingDB
Found 1 hit for monomerid = 36390
TargetBeta-mannosidase(Bacteroides thetaiotaomicron)
The Medical School, Newcastle University
LigandPNGBDBM36390((Z)-D-Gluconhydroximo-1,5-lactam, 15 | CID445248)
Affinity DataKi:  2.00E+6nM ΔG°:  -3.83kcal/molepH: 5.6 T: 2°C. Assay description: Putative mannosidase assay using wild-type protein Btman2A. Enzyme inhibition assay.
Ligand InfoMMDBPC cidPC sid
In DepthDetails ArticlePubMed