BDBM363926 US9856239, 37
SMILES CC(C)(Sc1ccncc1-c1ccc(cn1)C#N)C(O)=O
InChI Key InChIKey=LNAUKZIMNYTWKQ-UHFFFAOYSA-N
Data  1 IC50
  Tab Delimited (TSV)   2D SDfile   Computed 3D by Vconf -m prep SDfile
Find this compound or compounds like it in BindingDB:
Activity Spreadsheet -- Enzyme Inhibition Constant Data from BindingDB
Found 1 hit for monomerid = 363926
TargetSolute carrier family 22 member 12(Homo sapiens (Human))
Inventisbio Shanghai
US Patent
LigandPNGBDBM363926(US9856239, 37)
Affinity DataIC50: >1.00E+3nM. Assay description: Human kidney embryonic cells HEK-293T were grown in a petri dish (diameter=10 cm) containing DMEM and 10% of bovine fetal serum culture solution, and...
Ligand InfoPC cidPC sid
In DepthDetails US Patent