BDBM363961 1-[[3-(4-aminopyrido[3,2-d]pyrimidin-6-yl)-5-fluoro-phenyl]methyl]azetidine-3-carboxamide::US9855269, Compound 204
SMILES NC(=O)C1CN(Cc2cc(F)cc(c2)-c2ccc3ncnc(N)c3n2)C1
InChI Key InChIKey=IGIJMIAKSXSXBP-UHFFFAOYSA-N
Data  1 IC50
  Tab Delimited (TSV)   2D SDfile   Computed 3D by Vconf -m prep SDfile
Find this compound or compounds like it in BindingDB:
Activity Spreadsheet -- Enzyme Inhibition Constant Data from BindingDB
Found 1 hit for monomerid = 363961
TargetMitogen-activated protein kinase kinase kinase kinase 4(Homo sapiens (Human))
Genentech
US Patent
LigandPNGBDBM363961(1-[[3-(4-aminopyrido[3,2-d]pyrimidin-6-yl)-5-fluor...)
Affinity DataIC50:  186nM. Assay description: The kinase activity of purified human MAP4K4 kinase domain was measured by monitoring the phosphorylation of a peptide substrate derived from moesin ...
Ligand InfoPC cidPC sid
In DepthDetails US Patent