BDBM364008 US9856250, 85
SMILES CC1=C(C2C=CC=CC2O1)C(=O)NC[C@H]1C[C@@H]2CC[C@H](C1)N2CC(=O)NC(C)(C)C
InChI Key InChIKey=RHJHFIDRVSSTPJ-UGOIPVCYSA-N
Data  1 IC50
  Tab Delimited (TSV)   2D SDfile   Computed 3D by Vconf -m prep SDfile
Find this compound or compounds like it in BindingDB:
Activity Spreadsheet -- Enzyme Inhibition Constant Data from BindingDB
Found 1 hit for monomerid = 364008
TargetVoltage-dependent T-type calcium channel subunit alpha-1H(Homo sapiens (Human))
Toa Eiyo
US Patent
LigandPNGBDBM364008(US9856250, 85)
Affinity DataIC50:  15nM. Assay description: The HEK293 cells having human Cav3.2 stably expressed therein were cultured at 37° C. in Alpha-MEM, to which 10% (v/v) fetal bovine serum (FBS), peni...
Ligand InfoPC cidPC sid
In DepthDetails US Patent