BDBM364037 N-[3-(4-aminopyrido[3,2-d]pyrimidin-6-yl)-5-fluoro-phenyl]-2-(4-methylpiperazin-1-yl)ethanesulfonamide::US9855269, Compound 280
SMILES CN1CCN(CCS(=O)(=O)Nc2cc(F)cc(c2)-c2ccc3ncnc(N)c3n2)CC1
InChI Key InChIKey=NCHQVZONMVCJHZ-UHFFFAOYSA-N
Data  1 IC50
  Tab Delimited (TSV)   2D SDfile   Computed 3D by Vconf -m prep SDfile
Find this compound or compounds like it in BindingDB:
Activity Spreadsheet -- Enzyme Inhibition Constant Data from BindingDB
Found 1 hit for monomerid = 364037
TargetMitogen-activated protein kinase kinase kinase kinase 4(Homo sapiens (Human))
Genentech
US Patent
LigandPNGBDBM364037(N-[3-(4-aminopyrido[3,2-d]pyrimidin-6-yl)-5-fluoro...)
Affinity DataIC50:  138nM. Assay description: The kinase activity of purified human MAP4K4 kinase domain was measured by monitoring the phosphorylation of a peptide substrate derived from moesin ...
Ligand InfoPC cidPC sid
In DepthDetails US Patent