BDBM364118 US9856252, 10
SMILES CC(=O)N1CCC(CC1)c1cnc2[nH]c(nc2c1)-c1ccc(COc2ccccc2)cc1
InChI Key InChIKey=GGYWKNQJNUMZAM-UHFFFAOYSA-N
Data  1 IC50
  Tab Delimited (TSV)   2D SDfile   Computed 3D by Vconf -m prep SDfile
Find this compound or compounds like it in BindingDB:
Activity Spreadsheet -- Enzyme Inhibition Constant Data from BindingDB
Found 1 hit for monomerid = 364118
TargetProtein arginine N-methyltransferase 5(Homo sapiens (Human))
Cancer Therapeutics Crc
US Patent
LigandPNGBDBM364118(US9856252, 10)
Affinity DataIC50:  375nM. Assay description: The 6 μL assay reactions are run in Greiner brand black 384-well low volume plates. All reactions contained assay buffer (phosphate buffered sal...
Ligand InfoPC cidPC sid
In DepthDetails US Patent