BDBM364143 US9856252, 35
SMILES C(Oc1ccccc1)c1ccc(cc1)-c1nc2ccc(nc2[nH]1)C1CCCNC1
InChI Key
Data  1 IC50
  Tab Delimited (TSV)   2D SDfile   Computed 3D by Vconf -m prep SDfile
Find this compound or compounds like it in BindingDB:
Activity Spreadsheet -- Enzyme Inhibition Constant Data from BindingDB
Found 1 hit for monomerid = 364143
TargetProtein arginine N-methyltransferase 5(Homo sapiens (Human))
Cancer Therapeutics Crc
US Patent
LigandPNGBDBM364143(US9856252, 35)
Affinity DataIC50:  204nM. Assay description: The 6 μL assay reactions are run in Greiner brand black 384-well low volume plates. All reactions contained assay buffer (phosphate buffered sal...
Ligand InfoPC cidPC sid
In DepthDetails US Patent