BDBM364273 US9856257, 58
SMILES FC(F)(F)Cn1c2cc(cnc2c2[nH]ncc2c1=O)-c1ncccc1C#N
InChI Key InChIKey=VDMNBVDWPKJMCU-UHFFFAOYSA-N
Data  1 IC50
  Tab Delimited (TSV)   2D SDfile   Computed 3D by Vconf -m prep SDfile
Find this compound or compounds like it in BindingDB:
Activity Spreadsheet -- Enzyme Inhibition Constant Data from BindingDB
Found 1 hit for monomerid = 364273
TargetMethionine aminopeptidase 2(Homo sapiens (Human))
Sanofi
US Patent
LigandPNGBDBM364273(US9856257, 58)
Affinity DataIC50:  61nM. Assay description: For the enzymatic test, human MetAP2 protein was obtained from a culture supernatant of insect cells (sf9) infected with MetAP2 recombinant baculovir...
Ligand InfoPC cidPC sid
In DepthDetails US Patent