BDBM364303 US9856263, 23
SMILES COc1cc(Oc2nccn3nccc23)ccc1-c1c(C)ncnc1C
InChI Key InChIKey=WDYIBYXZWDKNPM-UHFFFAOYSA-N
Data  1 KI
  Tab Delimited (TSV)   2D SDfile   Computed 3D by Vconf -m prep SDfile
Find this compound or compounds like it in BindingDB:
Activity Spreadsheet -- Enzyme Inhibition Constant Data from BindingDB
Found 1 hit for monomerid = 364303
TargetD(1A) dopamine receptor(Homo sapiens (Human))
Pfizer
US Patent
LigandPNGBDBM364303(US9856263, 23)
Affinity DataKi:  894nM. Assay description: Frozen cells were quickly thawed, re-suspended in 50 mL warm media and allowed to sit for 5 min prior to centrifugation (1000 rpm) at room temperatur...
Ligand InfoPC cidPC sid
In DepthDetails US Patent