BDBM364346 US10570156, Compound 28::US9856274, Compound 28
SMILES Cc1cnc(C)c2cc(CCc3nc4c(ccc5ncccc45)[nH]3)nn12
InChI Key InChIKey=PNVDXSUCNHTQDA-UHFFFAOYSA-N
Data  2 IC50
  Tab Delimited (TSV)   2D SDfile   Computed 3D by Vconf -m prep SDfile
Find this compound or compounds like it in BindingDB:
Activity Spreadsheet -- Enzyme Inhibition Constant Data from BindingDB
Found 2 hits for monomerid = 364346
TargetcAMP and cAMP-inhibited cGMP 3',5'-cyclic phosphodiesterase 10A(Homo sapiens (Human))
Sunovion Pharmaceuticals
US Patent
LigandPNGBDBM364346(US10570156, Compound 28 | US9856274, Compound 28)
Affinity DataIC50:  55nM. Assay description: In one embodiment, the compounds provided herein were assayed for their ability to inhibit human PDE-10A. In one embodiment, the activities of the co...
Ligand InfoPC cidPC sid
In DepthDetails US Patent
TargetcAMP and cAMP-inhibited cGMP 3',5'-cyclic phosphodiesterase 10A(Homo sapiens (Human))
Sunovion Pharmaceuticals
US Patent
LigandPNGBDBM364346(US10570156, Compound 28 | US9856274, Compound 28)
Affinity DataIC50:  55nM. Assay description: In one embodiment, the compounds provided herein were assayed for their ability to inhibit human PDE-10A. In one embodiment, the activities of the co...
Ligand InfoPC cidPC sid
In DepthDetails US Patent