BDBM364369 4-[7-fluoro-3-[2-fluoro-6-(trifluoromethyl)benzoyl]-1-H-indol-1-yl]benzoic acid::US9861612, Comparator 2
SMILES OC(=O)c1ccc(cc1)-n1cc(C(=O)c2c(F)cccc2C(F)(F)F)c2cccc(F)c12
InChI Key InChIKey=VZVMTDYZSZLLMB-UHFFFAOYSA-N
Data  1 IC50
  Tab Delimited (TSV)   2D SDfile   Computed 3D by Vconf -m prep SDfile
Find this compound or compounds like it in BindingDB:
Activity Spreadsheet -- Enzyme Inhibition Constant Data from BindingDB
Found 1 hit for monomerid = 364369
TargetNuclear receptor ROR-gamma(Homo sapiens (Human))
Orca Pharmaceuticals
US Patent
LigandPNGBDBM364369(4-[7-fluoro-3-[2-fluoro-6-(trifluoromethyl)benzoyl...)
Affinity DataIC50:  61.9nM. Assay description: The assay was run in black 384 well plates (Greiner cat no: 784900). Various concentrations of test ligands in 0.1 microlitres DMSO were dispensed to...
Ligand InfoPC cidPC sid
In DepthDetails US Patent