BDBM364384 US9862679, Compound 2o
SMILES O=C(CSC(c1ccccc1)c1ccccc1)NC1CC1
InChI Key InChIKey=CCMHHQKXWQOCNL-UHFFFAOYSA-N
Data  3 KI
  Tab Delimited (TSV)   2D SDfile   Computed 3D by Vconf -m prep SDfile
Find this compound or compounds like it in BindingDB:
Activity Spreadsheet -- Enzyme Inhibition Constant Data from BindingDB
Found 3 hits for monomerid = 364384
TargetSodium-dependent dopamine transporter(Rattus norvegicus (rat))
The United States Of America, As Represented By The Secretary, Department Of Health And Human Services Office Of Technology Transfer, National Institutes Of Health
US Patent
LigandPNGBDBM364384(US9862679, Compound 2o)
Affinity DataKi:  1.39E+4nM. Assay description: Brains from male Sprague-Dawley rats weighing 200-225 g (Taconic Labs) were removed, striatum dissected and quickly frozen. Membranes were prepared b...
In DepthDetails US Patent
TargetSodium-dependent serotonin transporter(Rattus norvegicus (rat))
The United States Of America, As Represented By The Secretary, Department Of Health And Human Services Office Of Technology Transfer, National Institutes Of Health
US Patent
LigandPNGBDBM364384(US9862679, Compound 2o)
Affinity DataKi:  2.09E+4nM. Assay description: Brains from male Sprague-Dawley rats weighing 200-225 g (Taconic Labs, Germantown, N.Y.) were removed, midbrain dissected and rapidly frozen. Membran...
In DepthDetails US Patent
TargetTransporter(Rattus norvegicus (rat))
The United States Of America, As Represented By The Secretary, Department Of Health And Human Services Office Of Technology Transfer, National Institutes Of Health
US Patent
LigandPNGBDBM364384(US9862679, Compound 2o)
Affinity DataKi: >1.00E+5nM. Assay description: Brains from male Sprague-Dawley rats weighing 200-225 g (Taconic Labs, Germantown, N.Y.) were removed, frontal cortex dissected and rapidly frozen. M...
In DepthDetails US Patent