BDBM364395 US10913711, Compound 2z::US11555013, Compound 2z::US9862679, Compound 2z
SMILES Brc1ccc(cc1)C(SCC(=O)NCCCCc1ccccc1)c1ccc(Br)cc1
InChI Key InChIKey=PYFFLFRZZOWEGI-UHFFFAOYSA-N
Data  7 KI
  Tab Delimited (TSV)   2D SDfile   Computed 3D by Vconf -m prep SDfile
Find this compound or compounds like it in BindingDB:
Activity Spreadsheet -- Enzyme Inhibition Constant Data from BindingDB
Found 7 hits for monomerid = 364395
TargetSodium-dependent dopamine transporter(Rattus norvegicus (rat))
National Institute On Drug Abuse-Intramural Research Program
Curated by ChEMBL
LigandPNGBDBM364395(US10913711, Compound 2z | US11555013, Compound 2z ...)
Affinity DataKi:  405nM. Assay description: Displacement of [3H]WIN35,428 from Sprague-Dawley rat brain DAT after 120 mins by liquid scintillation counting analysis
Ligand InfoPC cidPC sid
In DepthDetails ArticlePubMed
TargetSodium-dependent dopamine transporter(Rattus norvegicus (rat))
National Institute On Drug Abuse-Intramural Research Program
Curated by ChEMBL
LigandPNGBDBM364395(US10913711, Compound 2z | US11555013, Compound 2z ...)
Affinity DataKi:  414nM. Assay description: Brains from male Sprague-Dawley rats weighing 200-225 g (Taconic Labs) were removed, striatum dissected and quickly frozen. Membranes were prepared b...
Ligand InfoPC cidPC sid
In DepthDetails US Patent
TargetSodium-dependent dopamine transporter(Rattus norvegicus (rat))
National Institute On Drug Abuse-Intramural Research Program
Curated by ChEMBL
LigandPNGBDBM364395(US10913711, Compound 2z | US11555013, Compound 2z ...)
Affinity DataKi:  414nM. Assay description: Dopamine Transporter Binding Assay. Brains from male Sprague-Dawley rats weighing 200-225 g (Taconic Labs) were removed, striatum dissected and quick...
Ligand InfoPC cidPC sid
In DepthDetails US Patent
TargetSodium-dependent dopamine transporter(Rattus norvegicus (rat))
National Institute On Drug Abuse-Intramural Research Program
Curated by ChEMBL
LigandPNGBDBM364395(US10913711, Compound 2z | US11555013, Compound 2z ...)
Affinity DataKi:  414nM. Assay description: Dopamine Transporter Binding Assay. Brains from male Sprague-Dawley rats weighing 200-225 g (Taconic Labs) were removed, striatum dissected and quick...
Ligand InfoPC cidPC sid
In DepthDetails US Patent
TargetSodium-dependent serotonin transporter(Rattus norvegicus (rat))
The United States Of America, As Represented By The Secretary, Department Of Health And Human Services
US Patent
LigandPNGBDBM364395(US10913711, Compound 2z | US11555013, Compound 2z ...)
Affinity DataKi: >1.00E+5nM. Assay description: Serotonin Transporter Binding Assay. Brains from male Sprague-Dawley rats weighing 200-225 g (Taconic Labs, Germantown, N.Y.) were removed, midbrain ...
Ligand InfoPC cidPC sid
In DepthDetails US Patent
TargetSodium-dependent serotonin transporter(Rattus norvegicus (rat))
The United States Of America, As Represented By The Secretary, Department Of Health And Human Services
US Patent
LigandPNGBDBM364395(US10913711, Compound 2z | US11555013, Compound 2z ...)
Affinity DataKi: >1.00E+5nM. Assay description: Serotonin Transporter Binding Assay. Brains from male Sprague-Dawley rats weighing 200-225 g (Taconic Labs, Germantown, N.Y.) were removed, midbrain ...
Ligand InfoPC cidPC sid
In DepthDetails US Patent
TargetSodium-dependent serotonin transporter(Rattus norvegicus (rat))
The United States Of America, As Represented By The Secretary, Department Of Health And Human Services
US Patent
LigandPNGBDBM364395(US10913711, Compound 2z | US11555013, Compound 2z ...)
Affinity DataKi: >1.00E+5nM. Assay description: Brains from male Sprague-Dawley rats weighing 200-225 g (Taconic Labs, Germantown, N.Y.) were removed, midbrain dissected and rapidly frozen. Membran...
Ligand InfoPC cidPC sid
In DepthDetails US Patent