BDBM364433 2-fluoro-5-(1-methyl-1H-pyrazol-3- yl)-N-[2-phenyl-5- (trifluoromethyl)-2H-indazol-3-yl]- 4-(trifluoromethyl)benzamide::US9862707, Example 7
SMILES Cn1ccc(n1)-c1cc(C(=O)Nc2n(nc3ccc(cc23)C(F)(F)F)-c2ccccc2)c(F)cc1C(F)(F)F
InChI Key InChIKey=KVEZRVHMLMTOFH-UHFFFAOYSA-N
Data  1 IC50
  Tab Delimited (TSV)   2D SDfile   Computed 3D by Vconf -m prep SDfile
Find this compound or compounds like it in BindingDB:
Activity Spreadsheet -- Enzyme Inhibition Constant Data from BindingDB
Found 1 hit for monomerid = 364433
TargetHigh affinity nerve growth factor receptor(Homo sapiens (Human))
Merck Sharp & Dohme
US Patent
LigandPNGBDBM364433(2-fluoro-5-(1-methyl-1H-pyrazol-3- yl)-N-[2-phenyl...)
Affinity DataIC50:  29nM. Assay description: TrkA functional activity was measured using a DiscoverX PathHunter assay. In this assay, U2OS cells express the human TrkA receptor as a fusion with ...
Ligand InfoPC cidPC sid
In DepthDetails US Patent