BDBM364488 US9862707, Example 62::US9862707, Example 63
SMILES Cn1ccc(n1)-c1cc(ccc1C(F)(F)F)C(=O)Nc1n(nc2cc(ccc12)C(C)(O)CO)-c1ccccc1
InChI Key InChIKey=SPYWZAXHYOVMFW-UHFFFAOYSA-N
Data  2 IC50
  Tab Delimited (TSV)   2D SDfile   Computed 3D by Vconf -m prep SDfile
Find this compound or compounds like it in BindingDB:
Activity Spreadsheet -- Enzyme Inhibition Constant Data from BindingDB
Found 2 hits for monomerid = 364488
TargetHigh affinity nerve growth factor receptor(Homo sapiens (Human))
Merck Sharp & Dohme
US Patent
LigandPNGBDBM364488(US9862707, Example 62 | US9862707, Example 63)
Affinity DataIC50:  15nM. Assay description: TrkA functional activity was measured using a DiscoverX PathHunter assay. In this assay, U2OS cells express the human TrkA receptor as a fusion with ...
Ligand InfoPC cidPC sid
In DepthDetails US Patent
TargetHigh affinity nerve growth factor receptor(Homo sapiens (Human))
Merck Sharp & Dohme
US Patent
LigandPNGBDBM364488(US9862707, Example 62 | US9862707, Example 63)
Affinity DataIC50:  4.90nM. Assay description: TrkA functional activity was measured using a DiscoverX PathHunter assay. In this assay, U2OS cells express the human TrkA receptor as a fusion with ...
Ligand InfoPC cidPC sid
In DepthDetails US Patent