BDBM364537 N-(3-Hydroxy-3-methyl-butyl)-4-methyl-3-{6-[1-(2-morpholin-4-yl-ethyl)-1H-pyrazol-4-yl]-pyrazin-2-yl}-benzenesulfonamide::US9862711, Example 9
SMILES Cc1ccc(cc1-c1cncc(n1)-c1cnn(CCN2CCOCC2)c1)S(=O)(=O)NCCC(C)(C)O
InChI Key InChIKey=BJMIGNFXBPNRHP-UHFFFAOYSA-N
Data  7 IC50
  Tab Delimited (TSV)   2D SDfile   Computed 3D by Vconf -m prep SDfile
Find this compound or compounds like it in BindingDB:
Activity Spreadsheet -- Enzyme Inhibition Constant Data from BindingDB
Found 7 hits for monomerid = 364537
LigandPNGBDBM364537(N-(3-Hydroxy-3-methyl-butyl)-4-methyl-3-{6-[1-(2-m...)
Affinity DataIC50:  260nM. Assay description: PI 3-Kinase Alpha (A), Pb 3-Kinase Beta (B), Vps34 (C), PI 4-Kinase Beta (D):The luminescence-based ATP detection reagent KinaseGlo was obtained from...
Ligand InfoPC cidPC sid
In DepthDetails US Patent
LigandPNGBDBM364537(N-(3-Hydroxy-3-methyl-butyl)-4-methyl-3-{6-[1-(2-m...)
Affinity DataIC50: >9.10E+3nM. Assay description: PI 3-Kinase Gamma (E), PI 3-Kinase Delta (F):The TR-FRET Adapta™ Universal Kinase Assay Kit was purchased from Invitrogen Corporation (Carlsbad/CA, U...
Ligand InfoPC cidPC sid
In DepthDetails US Patent
TargetPhosphatidylinositol 3-kinase catalytic subunit type 3(Homo sapiens (Human))
Novartis
US Patent
LigandPNGBDBM364537(N-(3-Hydroxy-3-methyl-butyl)-4-methyl-3-{6-[1-(2-m...)
Affinity DataIC50: >9.10E+3nM. Assay description: PI 3-Kinase Alpha (A), Pb 3-Kinase Beta (B), Vps34 (C), PI 4-Kinase Beta (D):The luminescence-based ATP detection reagent KinaseGlo was obtained from...
Ligand InfoPC cidPC sid
In DepthDetails US Patent
TargetSerine/threonine-protein kinase mTOR(Homo sapiens (Human))
Novartis
US Patent
LigandPNGBDBM364537(N-(3-Hydroxy-3-methyl-butyl)-4-methyl-3-{6-[1-(2-m...)
Affinity DataIC50: >9.10E+3nM. Assay description: mTOR: Binding Assays are based on the binding and displacement of an Alexa Fluor® 647-labeled, ATP-competitive kinase inhibitors to the kinase of int...
Ligand InfoPC cidPC sid
In DepthDetails US Patent
LigandPNGBDBM364537(N-(3-Hydroxy-3-methyl-butyl)-4-methyl-3-{6-[1-(2-m...)
Affinity DataIC50:  160nM. Assay description: PI 3-Kinase Gamma (E), PI 3-Kinase Delta (F):The TR-FRET Adapta™ Universal Kinase Assay Kit was purchased from Invitrogen Corporation (Carlsbad/CA, U...
Ligand InfoPC cidPC sid
In DepthDetails US Patent
LigandPNGBDBM364537(N-(3-Hydroxy-3-methyl-butyl)-4-methyl-3-{6-[1-(2-m...)
Affinity DataIC50:  10nM. Assay description: PI 3-Kinase Alpha (A), Pb 3-Kinase Beta (B), Vps34 (C), PI 4-Kinase Beta (D):The luminescence-based ATP detection reagent KinaseGlo was obtained from...
Ligand InfoPC cidPC sid
In DepthDetails US Patent
TargetPhosphatidylinositol 4-kinase beta(Homo sapiens (Human))
Novartis
US Patent
LigandPNGBDBM364537(N-(3-Hydroxy-3-methyl-butyl)-4-methyl-3-{6-[1-(2-m...)
Affinity DataIC50: >9.10E+3nM. Assay description: PI 3-Kinase Alpha (A), Pb 3-Kinase Beta (B), Vps34 (C), PI 4-Kinase Beta (D):The luminescence-based ATP detection reagent KinaseGlo was obtained from...
Ligand InfoPC cidPC sid
In DepthDetails US Patent