BDBM36456 6-[3-(Aminooxypropylamino)methyl]uracil, dihydrochloride, 4::CID25210524
SMILES NOCCCNCc1cc(=O)[nH]c(=O)[nH]1
InChI Key InChIKey=VOBYLIOZIUMHFH-UHFFFAOYSA-N
Data  1 KI
  Tab Delimited (TSV)   2D SDfile   Computed 3D by Vconf -m prep SDfile
Find this compound or compounds like it in BindingDB:
Activity Spreadsheet -- Enzyme Inhibition Constant Data from BindingDB
Found 1 hit for monomerid = 36456
TargetUracil-DNA glycosylase(Homo sapiens (Human))
Johns Hopkins University
LigandPNGBDBM36456(6-[3-(Aminooxypropylamino)methyl]uracil, dihydroch...)
Affinity DataKi:  7.00E+5nMpH: 8.0Assay Description:Inhibition of human uracil DNA glycosylase using high-throughput fluorescent molecular beacon DNA substrate.
Ligand InfoPC cidPC sid
In DepthDetails ArticlePubMed