BDBM364893 US9862730, Example 351
SMILES COc1nn2cc(nc2s1)-c1cc2c(OCc3ccc(OC)c(OCc4ccccc4)c3)cc(OC)cc2o1
InChI Key InChIKey=UCXXUPIMNLLOEK-UHFFFAOYSA-N
Data  1 IC50
  Tab Delimited (TSV)   2D SDfile   Computed 3D by Vconf -m prep SDfile
Find this compound or compounds like it in BindingDB:
Activity Spreadsheet -- Enzyme Inhibition Constant Data from BindingDB
Found 1 hit for monomerid = 364893
TargetProteinase-activated receptor 4(Homo sapiens (Human))
Bristol-Myers Squibb
US Patent
LigandPNGBDBM364893(US9862730, Example 351)
Affinity DataIC50:  2.23nM. Assay description: The FLIPR assay is an exemplary in vitro assay for measuring the activity of the PAR4 antagonists of the present invention. In this assay, intracellu...
Ligand InfoPC cidPC sid
In DepthDetails US Patent