BDBM364982 6-{3,4-trans-4-[1-(2-Azetidin-1-yl-ethyl)-4-(4-fluoro-3-trifluoromethyl-phenyl)-1H-imidazol-2-yl]-3-fluoro-piperidin-1-yl}-5-chloro-pyrimidin-4-ylamine::US9867826, Compound 11
SMILES Nc1ncnc(N2CC[C@H]([C@H](F)C2)c2nc(cn2CCN2CCC2)-c2ccc(F)c(c2)C(F)(F)F)c1Cl
InChI Key InChIKey=BPJUPXXKAPKTBS-CRAIPNDOSA-N
Data  2 IC50
  Tab Delimited (TSV)   2D SDfile   Computed 3D by Vconf -m prep SDfile
Find this compound or compounds like it in BindingDB:
Activity Spreadsheet -- Enzyme Inhibition Constant Data from BindingDB
Found 2 hits for monomerid = 364982
TargetRAC-alpha serine/threonine-protein kinase(Homo sapiens (Human))
Merck Patent
US Patent
LigandPNGBDBM364982(6-{3,4-trans-4-[1-(2-Azetidin-1-yl-ethyl)-4-(4-flu...)
Affinity DataIC50:  5.5nM. Assay description: AKT: A TTP Mosquito liquid handling instrument was used to place 125 nl of the appropriate concentration of inhibitor in 100% DMSO (for a dose respon...
Ligand InfoPC cidPC sid
In DepthDetails US Patent
TargetRibosomal protein S6 kinase beta-1 [T412E](Homo sapiens (Human))
Merck Patent
US Patent
LigandPNGBDBM364982(6-{3,4-trans-4-[1-(2-Azetidin-1-yl-ethyl)-4-(4-flu...)
Affinity DataIC50:  5.5nM. Assay description: P70S6K inhibitor compounds were diluted and plated in 96 well plates. A reaction mixture including the following components was then added to the com...
Ligand InfoPC cidPC sid
In DepthDetails US Patent