BDBM364998 US10633373, Example 15::US10669265, Example 15::US9868726, Example 15::methyl 6-amino-5-{5- [(anilinocarbonyl)amino]-1- benzothien-2-yl}nicotinate
SMILES COC(=O)c1cnc(N)c(c1)-c1cc2cc(NC(=O)Nc3ccccc3)ccc2s1
InChI Key InChIKey=JLHXQKPMWFALIC-UHFFFAOYSA-N
Data  7 IC50
  Tab Delimited (TSV)   2D SDfile   Computed 3D by Vconf -m prep SDfile
Find this compound or compounds like it in BindingDB:
Activity Spreadsheet -- Enzyme Inhibition Constant Data from BindingDB
Found 7 hits for monomerid = 364998
TargetPlatelet-derived growth factor receptor beta(Homo sapiens (Human))
Allergan
US Patent
LigandPNGBDBM364998(US10633373, Example 15 | US10669265, Example 15 | ...)
Affinity DataIC50:  137nM. Assay description: Biochemical PDGFRβ kinase assays were performed in 96 well microtiter plates that were coated overnight with 75 μg of poly-Glu-Tyr (4:1) in...
Ligand InfoPC cidPC sid
In DepthDetails US Patent
TargetVascular endothelial growth factor receptor 2(Homo sapiens (Human))
Allergan
US Patent
LigandPNGBDBM364998(US10633373, Example 15 | US10669265, Example 15 | ...)
Affinity DataIC50:  28nM. Assay description: Biochemical KDR kinase assays were performed in 96 well microtiter plates that were coated overnight with 75 μg/well of poly-Glu-Tyr (4:1) in 10...
Ligand InfoPC cidPC sid
In DepthDetails US Patent
TargetVascular endothelial growth factor receptor 2(Homo sapiens (Human))
Allergan
US Patent
LigandPNGBDBM364998(US10633373, Example 15 | US10669265, Example 15 | ...)
Affinity DataIC50:  137nM. Assay description: VEGFR2: Biochemical KDR kinase assays were performed in 96 well microtiter plates that were coated overnight with 75 μg/well of poly-Glu-Tyr (4:...
Ligand InfoPC cidPC sid
In DepthDetails US Patent
TargetPlatelet-derived growth factor receptor beta(Homo sapiens (Human))
Allergan
US Patent
LigandPNGBDBM364998(US10633373, Example 15 | US10669265, Example 15 | ...)
Affinity DataIC50:  28nM. Assay description: Biochemical PDGFRβ kinase assays were performed in 96 well microtiter plates that were coated overnight with 75 μg of poly-Glu-Tyr (4:1) in...
Ligand InfoPC cidPC sid
In DepthDetails US Patent
TargetVascular endothelial growth factor receptor 2(Homo sapiens (Human))
Allergan
US Patent
LigandPNGBDBM364998(US10633373, Example 15 | US10669265, Example 15 | ...)
Affinity DataIC50:  137nM. Assay description: Biochemical KDR kinase assays were performed in 96 well microtiter plates that were coated overnight with 75 μg/well of poly-Glu-Tyr (4:1) in 10...
Ligand InfoPC cidPC sid
In DepthDetails US Patent
TargetVascular endothelial growth factor receptor 2(Homo sapiens (Human))
Allergan
US Patent
LigandPNGBDBM364998(US10633373, Example 15 | US10669265, Example 15 | ...)
Affinity DataIC50:  1.35E+3nM. Assay description: Automated FLIPR (Fluorometric Imaging Plate Reader) technology was used to screen for inhibitors of VEGF induced increases in intracellular calcium l...
Ligand InfoPC cidPC sid
In DepthDetails US Patent
TargetPlatelet-derived growth factor receptor beta(Homo sapiens (Human))
Allergan
US Patent
LigandPNGBDBM364998(US10633373, Example 15 | US10669265, Example 15 | ...)
Affinity DataIC50:  28nM. Assay description: PDGFRβ: Biochemical PDGFRβ kinase assays were performed in 96 well microtiter plates that were coated overnight with 75 μg of poly-Glu...
Ligand InfoPC cidPC sid
In DepthDetails US Patent