BDBM365051 4-(3-benzyl-5-ethyl-4,5- dihydro-3H-1,2,2a1,5- tetraazaacenaphthylen-7-yl)- N-(1-methyl-1H-pyrazol-5- yl)pyrimidin-2-amine::US10278975, Compound I-17 R::US11376260, Example I-17R::US9867833, Compound I-17(R)
SMILES CCN1C[C@@H](Cc2ccccc2)c2nnc3cc(cc1n23)-c1ccnc(Nc2ccnn2C)n1
InChI Key InChIKey=AJHZVRDFBUABNE-LJQANCHMSA-N
Data  3 IC50
  Tab Delimited (TSV)   2D SDfile   Computed 3D by Vconf -m prep SDfile
Find this compound or compounds like it in BindingDB:
Activity Spreadsheet -- Enzyme Inhibition Constant Data from BindingDB
Found 3 hits for monomerid = 365051
TargetMitogen-activated protein kinase 1(Homo sapiens (Human))
Genentech
US Patent
LigandPNGBDBM365051(4-(3-benzyl-5-ethyl-4,5- dihydro-3H-1,2,2a1,5- tet...)
Affinity DataIC50:  3.39nM. Assay description: Compounds were tested in an enzymatic assay using human ERK-2 (Mitogen Activated Kinase 1), recombinantly expressed as an n-terminal 6-His fusion pro...
Ligand InfoPC cidPC sid
In DepthDetails US Patent
TargetMitogen-activated protein kinase 6(Homo sapiens (Human))
Genentech
US Patent
LigandPNGBDBM365051(4-(3-benzyl-5-ethyl-4,5- dihydro-3H-1,2,2a1,5- tet...)
Affinity DataIC50:  3.39nM. Assay description: Compounds were tested in an enzymatic assay using human ERK-2 (Mitogen Activated Kinase 1), recombinantly expressed as an n-terminal 6-His fusion pro...
Ligand InfoPC cidPC sid
In DepthDetails US Patent
TargetMitogen-activated protein kinase 1(Homo sapiens (Human))
Genentech
US Patent
LigandPNGBDBM365051(4-(3-benzyl-5-ethyl-4,5- dihydro-3H-1,2,2a1,5- tet...)
Affinity DataIC50:  3.39nM. Assay description: Compounds were tested in an enzymatic assay using human ERK-2 (Mitogen Activated Kinase 1), recombinantly expressed as an n-terminal 6-His fusion pro...
Ligand InfoPC cidPC sid
In DepthDetails US Patent