BDBM365166 9-((5-chloropyridin-2- yl)methyl)-6-methyl-4-(2-((1- methyl-1H-pyrazol-5- yl)amino)pyrimidin-4-yl)-8,9- dihydro-1,2,2a1,6- tetraazabenzo[cd]azulen- 7(6H)-one::US10517878, Compound I-84::US10842799, I-84::US9867833, Compound I-84(S)
SMILES CN1c2cc(cc3nnc(C(Cc4ccc(Cl)cn4)CC1=O)n23)-c1ccnc(Nc2ccnn2C)n1
InChI Key InChIKey=FWVGEZGVJAHMQL-UHFFFAOYSA-N
Data  3 IC50
  Tab Delimited (TSV)   2D SDfile   Computed 3D by Vconf -m prep SDfile
Find this compound or compounds like it in BindingDB:
Activity Spreadsheet -- Enzyme Inhibition Constant Data from BindingDB
Found 3 hits for monomerid = 365166
TargetMitogen-activated protein kinase 1(Homo sapiens (Human))
Genentech
US Patent
LigandPNGBDBM365166(9-((5-chloropyridin-2- yl)methyl)-6-methyl-4-(2-((...)
Affinity DataIC50:  32.7nM. Assay description: Compounds were tested in an enzymatic assay using human ERK-2 (Mitogen Activated Kinase 1), recombinantly expressed as an n-terminal 6-His fusion pro...
Ligand InfoPC cidPC sid
In DepthDetails US Patent
TargetMitogen-activated protein kinase 1(Homo sapiens (Human))
Genentech
US Patent
LigandPNGBDBM365166(9-((5-chloropyridin-2- yl)methyl)-6-methyl-4-(2-((...)
Affinity DataIC50:  0.102nM. Assay description: Compounds were tested in an enzymatic assay using human ERK-2 (Mitogen Activated Kinase 1), recombinantly expressed as an n-terminal 6-His fusion pro...
Ligand InfoPC cidPC sid
In DepthDetails US Patent
TargetMitogen-activated protein kinase 1(Homo sapiens (Human))
Genentech
US Patent
LigandPNGBDBM365166(9-((5-chloropyridin-2- yl)methyl)-6-methyl-4-(2-((...)
Affinity DataIC50:  0.102nM. Assay description: Compounds were tested in an enzymatic assay using human ERK-2 (Mitogen Activated Kinase 1), recombinantly expressed as an n-terminal 6-His fusion pro...
Ligand InfoPC cidPC sid
In DepthDetails US Patent