BDBM36518 CID46942382::N-(2-Methyl-3-(4-methyl-6-((4-(morpholine-4-carbonyl)phenyl)amino)-5-oxo-4,5-dihydropyrazin-2-yl)phenyl)acetamide, 4
SMILES CC(=O)Nc1cccc(c1C)-c1cn(C)c(=O)c(Nc2ccc(cc2)C(=O)N2CCOCC2)n1
InChI Key InChIKey=BIHCTMIAUVYGCP-UHFFFAOYSA-N
Data  1 IC50
  Tab Delimited (TSV)   2D SDfile   Computed 3D by Vconf -m prep SDfile
Find this compound or compounds like it in BindingDB:
Activity Spreadsheet -- Enzyme Inhibition Constant Data from BindingDB
Found 1 hit for monomerid = 36518
TargetTyrosine-protein kinase BTK(Homo sapiens (Human))
Cgi Pharmaceuticals
LigandPNGBDBM36518(CID46942382 | N-(2-Methyl-3-(4-methyl-6-((4-(morph...)
Affinity DataIC50:  2.69E+3nMpH: 7.5 T: 2°C. Assay description: Biochemical assay using Lanthascreen (human, full-lenght, C-terminal v5-His6 expressed in Sf9 cell) assay from Invitrogen.
In DepthDetails ArticlePubMed