BDBM36521 6-(tert-Butyl)-N-(2-methyl-3-(4-methyl-6-((4-(morpholine-4-carbonyl)phenyl)amino)-5-oxo-4,5-dihydropyrazin-2-yl)phenyl)nicotinamide, 7::CID11852095
SMILES Cc1c(NC(=O)c2ccc(nc2)C(C)(C)C)cccc1-c1cn(C)c(=O)c(Nc2ccc(cc2)C(=O)N2CCOCC2)n1
InChI Key InChIKey=UELBFGOGQPMFRP-UHFFFAOYSA-N
Data  3 IC50
  Tab Delimited (TSV)   2D SDfile   Computed 3D by Vconf -m prep SDfile
Find this compound or compounds like it in BindingDB:
Activity Spreadsheet -- Enzyme Inhibition Constant Data from BindingDB
Found 3 hits for monomerid = 36521
TargetTyrosine-protein kinase BTK(Homo sapiens (Human))
Cgi Pharmaceuticals
LigandPNGBDBM36521(6-(tert-Butyl)-N-(2-methyl-3-(4-methyl-6-((4-(morp...)
Affinity DataIC50:  650nMpH: 7.5 T: 2°C. Assay description: Biochemical assay using Lanthascreen (human, full-lenght, C-terminal v5-His6 expressed in Sf9 cell) assay from Invitrogen.
In DepthDetails ArticlePubMed
TargetTyrosine-protein kinase BTK(Homo sapiens (Human))
Cgi Pharmaceuticals
LigandPNGBDBM36521(6-(tert-Butyl)-N-(2-methyl-3-(4-methyl-6-((4-(morp...)
Affinity DataIC50:  130nM. Assay description: Inhibition of BTK (unknown origin) by Lanthascreen method
In DepthDetails ArticlePubMed
TargetTyrosine-protein kinase BTK(Mus musculus)
Genentech
Curated by ChEMBL
LigandPNGBDBM36521(6-(tert-Butyl)-N-(2-methyl-3-(4-methyl-6-((4-(morp...)
Affinity DataIC50:  3.50E+3nM. Assay description: Inhibition of BTK-mediated CD86 surface expression in Balb/c mouse splenocytes preincubated for 60 mins before F(ab')2 anti-mouse IgM measured after ...
In DepthDetails ArticlePubMed