BDBM36523 DW12
SMILES Oc1ccc2n3[Ru](C#N)[n+]4cccc5c6C(=O)NC(=O)c6c(c2c1)c3c45
InChI Key InChIKey=LNXMLVYPZDBDTF-UHFFFAOYSA-M
Data  2 IC50
  Tab Delimited (TSV)   2D SDfile   Computed 3D by Vconf -m prep SDfile
Find this compound or compounds like it in BindingDB:
Activity Spreadsheet -- Enzyme Inhibition Constant Data from BindingDB
Found 2 hits for monomerid = 36523
TargetGlycogen synthase kinase-3 beta(Homo sapiens (Human))
University Of Pennsylvania
LigandPNGBDBM36523(DW12)
Affinity DataIC50:  1.40nMpH: 7.5 T: 2°C. Assay description: Fluorescence polarization-based kinase in vitro assay using human PI3K alpha purchased from Echelon Biosciences and p110 alpha/p85 alpha from Upstate...
In DepthDetails ArticlePubMed
TargetPhosphatidylinositol 4,5-bisphosphate 3-kinase catalytic subunit gamma isoform(Homo sapiens (Human))
University Of Pennsylvania
LigandPNGBDBM36523(DW12)
Affinity DataIC50:  750nMpH: 7.5 T: 2°C. Assay description: Fluorescence polarization-based kinase in vitro assay using human PI3K alpha purchased from Echelon Biosciences and p110 alpha/p85 alpha from Upstate...
In DepthDetails ArticlePubMed